{"text_format":"1","workbook":"xlsx","n_sheets":7,"sheets":["出場資格者名簿","①個人種目参加調査・団体組手申込（表紙）","②参加調査（個人種目　形）","③参加調査（個人種目　組手）","④参加申込書（団体組手）","⑤参加申込書（団体形）","振込み証"],"not_rendered":{"charts":0,"images":0,"macros":1,"external_links":1,"defined_names":15,"comments":2,"pivot_tables":0},"unopened":[],"bounds":{"document_bytes":16777216,"sheet_cells":100000,"rows_first":2000,"rows_last":500,"rows_between":2000,"halvings":0,"cell_chars":16384,"cell_head_chars":4096},"cells_cut":0,"cells_raw":0,"read":"whole","date_system":"1900"}

{"sheet":"出場資格者名簿","index":0,"n_rows":146,"n_cols":6,"rows_kept":146,"cut":false,"hidden":false,"merged":[]}
["【男子】"]
["種目","学年","番号",null,"名　前","県"]
["男子形","1年",1,{"$f":"A3&B3&C3","v":"男子形1年1"},"石川 琉之助","沖縄県"]
["男子形","1年",2,{"$f":"A4&B4&C4","v":"男子形1年2"},"市村 全","福岡県"]
["男子形","1年",3,"男子形1年3","井之上 蒼空","宮崎県"]
["男子形","1年",4,"男子形1年4","国分 エイト","福岡県"]
["男子形","1年",5,"男子形1年5","砂岡 志紀","熊本県"]
["男子形","1年",6,"男子形1年6","田中 柊","福岡県"]
["男子形","2年",1,"男子形2年1","石原 健誠","沖縄県"]
["男子形","2年",2,"男子形2年2","八頭司 絆正","福岡県"]
["男子形","2年",3,"男子形2年3","平 咲来","福岡県"]
["男子形","2年",4,"男子形2年4","大場 善志朗","福岡県"]
["男子形","2年",5,"男子形2年5","国分 ユウ","福岡県"]
["男子形","2年",6,"男子形2年6","西 丈汰","福岡県"]
["男子形","3年",1,"男子形3年1","市村 丞","福岡県"]
["男子形","3年",2,"男子形3年2","大城 清和","沖縄県"]
["男子形","3年",3,"男子形3年3","新城 光琉","沖縄県"]
["男子形","3年",4,"男子形3年4","信國 晴輝","福岡県"]
["男子形","3年",5,"男子形3年5","園田 晟士","福岡県"]
["男子形","3年",6,"男子形3年6","森 葵志也","福岡県"]
{"$rows_left_out":127}
{"sheet":"①個人種目参加調査・団体組手申込（表紙）","index":1,"n_rows":49,"n_cols":34,"rows_kept":49,"cut":false,"hidden":false,"merged":[[41,32,42,34],[41,35,42,41],[44,32,45,34],[44,35,45,41],[47,32,48,34],[47,35,48,41],[32,32,33,34],[32,35,33,41],[35,32,36,34],[35,35,36,41],[38,32,39,34],[38,35,39,41],[47,25,48,27],[47,28,48,29],[47,30,48,31],[48,2,48,4],[48,5,48,7],[47,2,47,4],[47,5,47,7],[47,15,48,17],[47,8,47,14],[47,18,48,24],[48,8,48,14],[44,25,45,27],[44,28,45,29],[44,30,45,31],[45,2,45,4],[45,5,45,7],[44,2,44,4],[44,5,44,7],[44,15,45,17],[44,8,44,14],[44,18,45,24],[45,8,45,14],[41,25,42,27],[41,28,42,29],[41,30,42,31],[42,2,42,4],[42,5,42,7],[41,2,41,4],[41,5,41,7],[41,15,42,17],[41,8,41,14],[41,18,42,24],[42,8,42,14],[38,25,39,27],[38,28,39,29],[38,30,39,31],[39,2,39,4],[39,5,39,7],[38,2,38,4],[38,5,38,7],[38,15,39,17],[38,8,38,14],[38,18,39,24],[39,8,39,14],[35,25,36,27],[35,28,36,29],[35,30,36,31],[36,2,36,4],[36,5,36,7],[35,2,35,4],[35,5,35,7],[35,15,36,17],[35,8,35,14],[35,18,36,24],[36,8,36,14],[0,1,0,22],[1,1,1,22],[3,9,4,13],[3,1,4,8],[3,14,4,22],[33,2,33,4],[32,2,32,4],[7,1,7,22],[17,2,17,12],[27,4,27,7],[28,4,28,7],[19,2,19,12],[20,2,20,12],[31,18,31,19],[31,20,31,21],[32,5,32,7],[33,5,33,7],[31,1,31,14],[33,8,33,14],[32,8,32,14],[31,28,31,29],[31,30,31,31],[32,30,33,31],[32,28,33,29],[32,15,33,17],[32,25,33,27],[32,18,33,24]]}
[null,"令和6年度第4回全日本少年少女空手道選抜大会"]
[null,"個人種目参加調査並びに団体組手参加申込書(表紙）"]
[]
[null,"道場名",null,null,null,null,null,null,null,"熊本"]
[]
[]
[null,"令和5年度第3回全日本少年少女空手道選抜大会に下記のとおり参加を申し込みます。"]
[null,"記"]
[null,"(1)申込書類①～⑦は，データファイルもメールにて送りました。"]
[null,null,"①参加申込書（表紙）　本紙",null,null,null,null,null,null,null,null,null,null,null,null,null,null,null,null,null,null,null,null,null,null,null,null,null,null,"福岡"]
[null,"　","②参加申込書（個人種目　形）",null,null,null,null,null,null,null,null,null,null,null,null,null,null,null,null,null,null,null,null,null,null,null,null,null,null,"長崎"]
[null,null,"③参加申込書（個人種目　組手）",null,null,null,null,null,null,null,null,null,null,null,null,null,null,null,null,null,null,null,null,null,null,null,null,null,null,"佐賀"]
[null,null,"④参加申込書（団体種目）",null,null,null,null,null,null,null,null,null,null,null,null,null,null,null,null,null,null,null,null,null,null,null,null,null,null,"熊本"]
[null,null,"⑤プログラム用男子名簿",null,null,null,null,null,null,null,null,null,null,null,null,null,null,null,null,null,null,null,null,null,null,null,null,null,null,"大分"]
[null,null,"⑥プログラム用女子名簿",null,null,null,null,null,null,null,null,null,null,null,null,null,null,null,null,null,null,null,null,null,null,null,null,null,null,"宮崎"]
[null,null,"⑦派遣審判員連絡先",null,null,null,null,null,null,null,null,null,null,null,null,null,null,null,null,null,null,null,null,null,null,null,null,null,null,"鹿児島"]
[null,"◆記載者",null,null,null,null,null,null,null,null,null,null,null,null,null,null,null,null,null,null,null,null,null,null,null,null,null,null,null,"沖縄"]
[null,"氏名フリガナ"]
[null,"氏名"]
[null,"郵便番号",null,null,null,null,null,null,null,null,null,null,null,null,null,null,null,null,null,null,null,null,null,null,null,null,null,null,null,"全国"]
{"$rows_left_out":30}
{"sheet":"②参加調査（個人種目　形）","index":2,"n_rows":68,"n_cols":24,"rows_kept":68,"cut":false,"hidden":false,"merged":[[6,18,6,19],[44,1,44,11],[2,1,2,12],[3,1,3,10],[4,1,4,3],[6,6,6,7]]}
["要送信・要送付"]
[]
[null,"令和5年度第3回全日本少年少女空手道選抜大会"]
[null,"参加申込書(個人種目　形）"]
[null,"地区名",null,null,null,null,"九州","地区協議会"]
[]
[null,null,null,null,"名簿の番号",null,"【　男子　】",null,null,null,null,null,null,null,null,null,"名簿の番号",null,"【　女子　】"]
[null,null,"種目","学年","番号",null,"選手氏名","ﾌﾘｶﾅ","県名","出場意向","全空連会員番号","公認段級",null,null,"種目","学年","番号",null,"選手氏名","ﾌﾘｶﾅ","県名","出場意向","全空連会員番号","公認段級"]
[null,1,"男子形",null,null,{"$f":"C9&D9&E9","v":"男子形"},{"$f":"IF($D9=\"\",\"\",VLOOKUP('②参加調査（個人種目　形）'!$F9,出場資格者名簿!$D$3:$F$146,2,FALSE))","v":""},null,{"$f":"IF($D9=\"\",\"\",VLOOKUP('②参加調査（個人種目　形）'!$F9,出場資格者名簿!$D$3:$F$146,3,FALSE))","v":""},null,null,null,null,1,"女子形",null,null,{"$f":"O9&P9&Q9","v":"女子形"},{"$f":"IF($P9=\"\",\"\",VLOOKUP('②参加調査（個人種目　形）'!$R9,出場資格者名簿!$D$3:$F$146,2,FALSE))","v":""},null,{"$f":"IF($P9=\"\",\"\",VLOOKUP('②参加調査（個人種目　形）'!$R9,出場資格者名簿!$D$3:$F$146,3,FALSE))","v":""}]
[null,2,"男子形",null,null,{"$f":"C10&D10&E10","v":"男子形"},{"$f":"IF(D10=\"\",\"\",VLOOKUP('②参加調査（個人種目　形）'!F10,出場資格者名簿!$D$3:$F$146,2,FALSE))","v":""},null,{"$f":"IF($D10=\"\",\"\",VLOOKUP('②参加調査（個人種目　形）'!$F10,出場資格者名簿!$D$3:$F$146,3,FALSE))","v":""},null,null,null,null,2,"女子形",null,null,{"$f":"O10&P10&Q10","v":"女子形"},{"$f":"IF(P10=\"\",\"\",VLOOKUP('②参加調査（個人種目　形）'!R10,出場資格者名簿!$D$3:$F$146,2,FALSE))","v":""},null,{"$f":"IF($P10=\"\",\"\",VLOOKUP('②参加調査（個人種目　形）'!$R10,出場資格者名簿!$D$3:$F$146,3,FALSE))","v":""}]
[null,3,"男子形",null,null,"男子形",{"$f":"IF(D11=\"\",\"\",VLOOKUP('②参加調査（個人種目　形）'!F11,出場資格者名簿!$D$3:$F$146,2,FALSE))","v":""},null,{"$f":"IF($D11=\"\",\"\",VLOOKUP('②参加調査（個人種目　形）'!$F11,出場資格者名簿!$D$3:$F$146,3,FALSE))","v":""},null,null,null,null,3,"女子形",null,null,"女子形",{"$f":"IF(P11=\"\",\"\",VLOOKUP('②参加調査（個人種目　形）'!R11,出場資格者名簿!$D$3:$F$146,2,FALSE))","v":""},null,{"$f":"IF($P11=\"\",\"\",VLOOKUP('②参加調査（個人種目　形）'!$R11,出場資格者名簿!$D$3:$F$146,3,FALSE))","v":""}]
[null,4,"男子形",null,null,"男子形",{"$f":"IF(D12=\"\",\"\",VLOOKUP('②参加調査（個人種目　形）'!F12,出場資格者名簿!$D$3:$F$146,2,FALSE))","v":""},null,{"$f":"IF($D12=\"\",\"\",VLOOKUP('②参加調査（個人種目　形）'!$F12,出場資格者名簿!$D$3:$F$146,3,FALSE))","v":""},null,null,null,null,4,"女子形",null,null,"女子形",{"$f":"IF(P12=\"\",\"\",VLOOKUP('②参加調査（個人種目　形）'!R12,出場資格者名簿!$D$3:$F$146,2,FALSE))","v":""},null,{"$f":"IF($P12=\"\",\"\",VLOOKUP('②参加調査（個人種目　形）'!$R12,出場資格者名簿!$D$3:$F$146,3,FALSE))","v":""}]
[null,5,"男子形",null,null,"男子形",{"$f":"IF(D13=\"\",\"\",VLOOKUP('②参加調査（個人種目　形）'!F13,出場資格者名簿!$D$3:$F$146,2,FALSE))","v":""},null,{"$f":"IF($D13=\"\",\"\",VLOOKUP('②参加調査（個人種目　形）'!$F13,出場資格者名簿!$D$3:$F$146,3,FALSE))","v":""},null,null,null,null,5,"女子形",null,null,"女子形",{"$f":"IF(P13=\"\",\"\",VLOOKUP('②参加調査（個人種目　形）'!R13,出場資格者名簿!$D$3:$F$146,2,FALSE))","v":""},null,{"$f":"IF($P13=\"\",\"\",VLOOKUP('②参加調査（個人種目　形）'!$R13,出場資格者名簿!$D$3:$F$146,3,FALSE))","v":""}]
[null,6,"男子形",null,null,"男子形",{"$f":"IF(D14=\"\",\"\",VLOOKUP('②参加調査（個人種目　形）'!F14,出場資格者名簿!$D$3:$F$146,2,FALSE))","v":""},null,{"$f":"IF($D14=\"\",\"\",VLOOKUP('②参加調査（個人種目　形）'!$F14,出場資格者名簿!$D$3:$F$146,3,FALSE))","v":""},null,null,null,null,6,"女子形",null,null,"女子形",{"$f":"IF(P14=\"\",\"\",VLOOKUP('②参加調査（個人種目　形）'!R14,出場資格者名簿!$D$3:$F$146,2,FALSE))","v":""},null,{"$f":"IF($P14=\"\",\"\",VLOOKUP('②参加調査（個人種目　形）'!$R14,出場資格者名簿!$D$3:$F$146,3,FALSE))","v":""}]
[null,7,"男子形",null,null,"男子形",{"$f":"IF(D15=\"\",\"\",VLOOKUP('②参加調査（個人種目　形）'!F15,出場資格者名簿!$D$3:$F$146,2,FALSE))","v":""},null,{"$f":"IF($D15=\"\",\"\",VLOOKUP('②参加調査（個人種目　形）'!$F15,出場資格者名簿!$D$3:$F$146,3,FALSE))","v":""},null,null,null,null,7,"女子形",null,null,"女子形",{"$f":"IF(P15=\"\",\"\",VLOOKUP('②参加調査（個人種目　形）'!R15,出場資格者名簿!$D$3:$F$146,2,FALSE))","v":""},null,{"$f":"IF($P15=\"\",\"\",VLOOKUP('②参加調査（個人種目　形）'!$R15,出場資格者名簿!$D$3:$F$146,3,FALSE))","v":""}]
[null,8,"男子形",null,null,"男子形",{"$f":"IF(D16=\"\",\"\",VLOOKUP('②参加調査（個人種目　形）'!F16,出場資格者名簿!$D$3:$F$146,2,FALSE))","v":""},null,{"$f":"IF($D16=\"\",\"\",VLOOKUP('②参加調査（個人種目　形）'!$F16,出場資格者名簿!$D$3:$F$146,3,FALSE))","v":""},null,null,null,null,8,"女子形",null,null,"女子形",{"$f":"IF(P16=\"\",\"\",VLOOKUP('②参加調査（個人種目　形）'!R16,出場資格者名簿!$D$3:$F$146,2,FALSE))","v":""},null,{"$f":"IF($P16=\"\",\"\",VLOOKUP('②参加調査（個人種目　形）'!$R16,出場資格者名簿!$D$3:$F$146,3,FALSE))","v":""}]
[null,9,"男子形",null,null,"男子形",{"$f":"IF(D17=\"\",\"\",VLOOKUP('②参加調査（個人種目　形）'!F17,出場資格者名簿!$D$3:$F$146,2,FALSE))","v":""},null,{"$f":"IF($D17=\"\",\"\",VLOOKUP('②参加調査（個人種目　形）'!$F17,出場資格者名簿!$D$3:$F$146,3,FALSE))","v":""},null,null,null,null,9,"女子形",null,null,"女子形",{"$f":"IF(P17=\"\",\"\",VLOOKUP('②参加調査（個人種目　形）'!R17,出場資格者名簿!$D$3:$F$146,2,FALSE))","v":""},null,{"$f":"IF($P17=\"\",\"\",VLOOKUP('②参加調査（個人種目　形）'!$R17,出場資格者名簿!$D$3:$F$146,3,FALSE))","v":""}]
[null,10,"男子形",null,null,"男子形",{"$f":"IF(D18=\"\",\"\",VLOOKUP('②参加調査（個人種目　形）'!F18,出場資格者名簿!$D$3:$F$146,2,FALSE))","v":""},null,{"$f":"IF($D18=\"\",\"\",VLOOKUP('②参加調査（個人種目　形）'!$F18,出場資格者名簿!$D$3:$F$146,3,FALSE))","v":""},null,null,null,null,10,"女子形",null,null,"女子形",{"$f":"IF(P18=\"\",\"\",VLOOKUP('②参加調査（個人種目　形）'!R18,出場資格者名簿!$D$3:$F$146,2,FALSE))","v":""},null,{"$f":"IF($P18=\"\",\"\",VLOOKUP('②参加調査（個人種目　形）'!$R18,出場資格者名簿!$D$3:$F$146,3,FALSE))","v":""}]
[null,11,"男子形",null,null,"男子形",{"$f":"IF(D19=\"\",\"\",VLOOKUP('②参加調査（個人種目　形）'!F19,出場資格者名簿!$D$3:$F$146,2,FALSE))","v":""},null,{"$f":"IF($D19=\"\",\"\",VLOOKUP('②参加調査（個人種目　形）'!$F19,出場資格者名簿!$D$3:$F$146,3,FALSE))","v":""},null,null,null,null,11,"女子形",null,null,"女子形",{"$f":"IF(P19=\"\",\"\",VLOOKUP('②参加調査（個人種目　形）'!R19,出場資格者名簿!$D$3:$F$146,2,FALSE))","v":""},null,{"$f":"IF($P19=\"\",\"\",VLOOKUP('②参加調査（個人種目　形）'!$R19,出場資格者名簿!$D$3:$F$146,3,FALSE))","v":""}]
[null,12,"男子形",null,null,"男子形",{"$f":"IF(D20=\"\",\"\",VLOOKUP('②参加調査（個人種目　形）'!F20,出場資格者名簿!$D$3:$F$146,2,FALSE))","v":""},null,{"$f":"IF($D20=\"\",\"\",VLOOKUP('②参加調査（個人種目　形）'!$F20,出場資格者名簿!$D$3:$F$146,3,FALSE))","v":""},null,null,null,null,12,"女子形",null,null,"女子形",{"$f":"IF(P20=\"\",\"\",VLOOKUP('②参加調査（個人種目　形）'!R20,出場資格者名簿!$D$3:$F$146,2,FALSE))","v":""},null,{"$f":"IF($P20=\"\",\"\",VLOOKUP('②参加調査（個人種目　形）'!$R20,出場資格者名簿!$D$3:$F$146,3,FALSE))","v":""}]
{"$rows_left_out":49}
{"sheet":"③参加調査（個人種目　組手）","index":3,"n_rows":68,"n_cols":24,"rows_kept":68,"cut":false,"hidden":false,"merged":[[6,18,6,19],[44,1,44,11],[2,1,2,12],[3,1,3,10],[4,1,4,3],[6,6,6,7]]}
["要送信・要送付"]
[]
[null,"令和5年度第3回全日本少年少女空手道選抜大会"]
[null,"参加申込書(個人種目　組手）"]
[null,"地区名",null,null,null,null,"九州","地区協議会"]
[]
[null,null,null,null,null,null,"【　男子　】",null,null,null,null,null,null,null,null,null,null,null,"【　女子　】"]
[null,null,"種目","学年","番号",null,"選手氏名","ﾌﾘｶﾅ","県名","出場意向","全空連会員番号","公認段級",null,null,"種目","学年","番号",null,"選手氏名","ﾌﾘｶﾅ","県名","出場意向","全空連会員番号","公認段級"]
[null,1,"男子組手",null,null,{"$f":"C9&D9&E9","v":"男子組手"},{"$f":"IF($D9=\"\",\"\",VLOOKUP('③参加調査（個人種目　組手）'!$F9,出場資格者名簿!$D$3:$F$146,2,FALSE))","v":""},null,{"$f":"IF($D9=\"\",\"\",VLOOKUP('③参加調査（個人種目　組手）'!$F9,出場資格者名簿!$D$3:$F$146,3,FALSE))","v":""},null,null,null,null,1,"女子組手",null,null,{"$f":"O9&P9&Q9","v":"女子組手"},{"$f":"IF($P9=\"\",\"\",VLOOKUP('③参加調査（個人種目　組手）'!$R9,出場資格者名簿!$D$3:$F$146,2,FALSE))","v":""},null,{"$f":"IF($P9=\"\",\"\",VLOOKUP('③参加調査（個人種目　組手）'!$R9,出場資格者名簿!$D$3:$F$146,3,FALSE))","v":""}]
[null,2,"男子組手",null,null,{"$f":"C10&D10&E10","v":"男子組手"},{"$f":"IF(D10=\"\",\"\",VLOOKUP('③参加調査（個人種目　組手）'!F10,出場資格者名簿!$D$3:$F$146,2,FALSE))","v":""},null,{"$f":"IF($D10=\"\",\"\",VLOOKUP('③参加調査（個人種目　組手）'!$F10,出場資格者名簿!$D$3:$F$146,3,FALSE))","v":""},null,null,null,null,2,"女子組手",null,null,{"$f":"O10&P10&Q10","v":"女子組手"},{"$f":"IF(P10=\"\",\"\",VLOOKUP('③参加調査（個人種目　組手）'!R10,出場資格者名簿!$D$3:$F$146,2,FALSE))","v":""},null,{"$f":"IF($P10=\"\",\"\",VLOOKUP('③参加調査（個人種目　組手）'!$R10,出場資格者名簿!$D$3:$F$146,3,FALSE))","v":""}]
[null,3,"男子組手",null,null,"男子組手",{"$f":"IF(D11=\"\",\"\",VLOOKUP('③参加調査（個人種目　組手）'!F11,出場資格者名簿!$D$3:$F$146,2,FALSE))","v":""},null,{"$f":"IF($D11=\"\",\"\",VLOOKUP('③参加調査（個人種目　組手）'!$F11,出場資格者名簿!$D$3:$F$146,3,FALSE))","v":""},null,null,null,null,3,"女子組手",null,null,"女子組手",{"$f":"IF(P11=\"\",\"\",VLOOKUP('③参加調査（個人種目　組手）'!R11,出場資格者名簿!$D$3:$F$146,2,FALSE))","v":""},null,{"$f":"IF($P11=\"\",\"\",VLOOKUP('③参加調査（個人種目　組手）'!$R11,出場資格者名簿!$D$3:$F$146,3,FALSE))","v":""}]
[null,4,"男子組手",null,null,"男子組手",{"$f":"IF(D12=\"\",\"\",VLOOKUP('③参加調査（個人種目　組手）'!F12,出場資格者名簿!$D$3:$F$146,2,FALSE))","v":""},null,{"$f":"IF($D12=\"\",\"\",VLOOKUP('③参加調査（個人種目　組手）'!$F12,出場資格者名簿!$D$3:$F$146,3,FALSE))","v":""},null,null,null,null,4,"女子組手",null,null,"女子組手",{"$f":"IF(P12=\"\",\"\",VLOOKUP('③参加調査（個人種目　組手）'!R12,出場資格者名簿!$D$3:$F$146,2,FALSE))","v":""},null,{"$f":"IF($P12=\"\",\"\",VLOOKUP('③参加調査（個人種目　組手）'!$R12,出場資格者名簿!$D$3:$F$146,3,FALSE))","v":""}]
[null,5,"男子組手",null,null,"男子組手",{"$f":"IF(D13=\"\",\"\",VLOOKUP('③参加調査（個人種目　組手）'!F13,出場資格者名簿!$D$3:$F$146,2,FALSE))","v":""},null,{"$f":"IF($D13=\"\",\"\",VLOOKUP('③参加調査（個人種目　組手）'!$F13,出場資格者名簿!$D$3:$F$146,3,FALSE))","v":""},null,null,null,null,5,"女子組手",null,null,"女子組手",{"$f":"IF(P13=\"\",\"\",VLOOKUP('③参加調査（個人種目　組手）'!R13,出場資格者名簿!$D$3:$F$146,2,FALSE))","v":""},null,{"$f":"IF($P13=\"\",\"\",VLOOKUP('③参加調査（個人種目　組手）'!$R13,出場資格者名簿!$D$3:$F$146,3,FALSE))","v":""}]
[null,6,"男子組手",null,null,"男子組手",{"$f":"IF(D14=\"\",\"\",VLOOKUP('③参加調査（個人種目　組手）'!F14,出場資格者名簿!$D$3:$F$146,2,FALSE))","v":""},null,{"$f":"IF($D14=\"\",\"\",VLOOKUP('③参加調査（個人種目　組手）'!$F14,出場資格者名簿!$D$3:$F$146,3,FALSE))","v":""},null,null,null,null,6,"女子組手",null,null,"女子組手",{"$f":"IF(P14=\"\",\"\",VLOOKUP('③参加調査（個人種目　組手）'!R14,出場資格者名簿!$D$3:$F$146,2,FALSE))","v":""},null,{"$f":"IF($P14=\"\",\"\",VLOOKUP('③参加調査（個人種目　組手）'!$R14,出場資格者名簿!$D$3:$F$146,3,FALSE))","v":""}]
[null,7,"男子組手",null,null,"男子組手",{"$f":"IF(D15=\"\",\"\",VLOOKUP('③参加調査（個人種目　組手）'!F15,出場資格者名簿!$D$3:$F$146,2,FALSE))","v":""},null,{"$f":"IF($D15=\"\",\"\",VLOOKUP('③参加調査（個人種目　組手）'!$F15,出場資格者名簿!$D$3:$F$146,3,FALSE))","v":""},null,null,null,null,7,"女子組手",null,null,"女子組手",{"$f":"IF(P15=\"\",\"\",VLOOKUP('③参加調査（個人種目　組手）'!R15,出場資格者名簿!$D$3:$F$146,2,FALSE))","v":""},null,{"$f":"IF($P15=\"\",\"\",VLOOKUP('③参加調査（個人種目　組手）'!$R15,出場資格者名簿!$D$3:$F$146,3,FALSE))","v":""}]
[null,8,"男子組手",null,null,"男子組手",{"$f":"IF(D16=\"\",\"\",VLOOKUP('③参加調査（個人種目　組手）'!F16,出場資格者名簿!$D$3:$F$146,2,FALSE))","v":""},null,{"$f":"IF($D16=\"\",\"\",VLOOKUP('③参加調査（個人種目　組手）'!$F16,出場資格者名簿!$D$3:$F$146,3,FALSE))","v":""},null,null,null,null,8,"女子組手",null,null,"女子組手",{"$f":"IF(P16=\"\",\"\",VLOOKUP('③参加調査（個人種目　組手）'!R16,出場資格者名簿!$D$3:$F$146,2,FALSE))","v":""},null,{"$f":"IF($P16=\"\",\"\",VLOOKUP('③参加調査（個人種目　組手）'!$R16,出場資格者名簿!$D$3:$F$146,3,FALSE))","v":""}]
[null,9,"男子組手",null,null,"男子組手",{"$f":"IF(D17=\"\",\"\",VLOOKUP('③参加調査（個人種目　組手）'!F17,出場資格者名簿!$D$3:$F$146,2,FALSE))","v":""},null,{"$f":"IF($D17=\"\",\"\",VLOOKUP('③参加調査（個人種目　組手）'!$F17,出場資格者名簿!$D$3:$F$146,3,FALSE))","v":""},null,null,null,null,9,"女子組手",null,null,"女子組手",{"$f":"IF(P17=\"\",\"\",VLOOKUP('③参加調査（個人種目　組手）'!R17,出場資格者名簿!$D$3:$F$146,2,FALSE))","v":""},null,{"$f":"IF($P17=\"\",\"\",VLOOKUP('③参加調査（個人種目　組手）'!$R17,出場資格者名簿!$D$3:$F$146,3,FALSE))","v":""}]
[null,10,"男子組手",null,null,"男子組手",{"$f":"IF(D18=\"\",\"\",VLOOKUP('③参加調査（個人種目　組手）'!F18,出場資格者名簿!$D$3:$F$146,2,FALSE))","v":""},null,{"$f":"IF($D18=\"\",\"\",VLOOKUP('③参加調査（個人種目　組手）'!$F18,出場資格者名簿!$D$3:$F$146,3,FALSE))","v":""},null,null,null,null,10,"女子組手",null,null,"女子組手",{"$f":"IF(P18=\"\",\"\",VLOOKUP('③参加調査（個人種目　組手）'!R18,出場資格者名簿!$D$3:$F$146,2,FALSE))","v":""},null,{"$f":"IF($P18=\"\",\"\",VLOOKUP('③参加調査（個人種目　組手）'!$R18,出場資格者名簿!$D$3:$F$146,3,FALSE))","v":""}]
[null,11,"男子組手",null,null,"男子組手",{"$f":"IF(D19=\"\",\"\",VLOOKUP('③参加調査（個人種目　組手）'!F19,出場資格者名簿!$D$3:$F$146,2,FALSE))","v":""},null,{"$f":"IF($D19=\"\",\"\",VLOOKUP('③参加調査（個人種目　組手）'!$F19,出場資格者名簿!$D$3:$F$146,3,FALSE))","v":""},null,null,null,null,11,"女子組手",null,null,"女子組手",{"$f":"IF(P19=\"\",\"\",VLOOKUP('③参加調査（個人種目　組手）'!R19,出場資格者名簿!$D$3:$F$146,2,FALSE))","v":""},null,{"$f":"IF($P19=\"\",\"\",VLOOKUP('③参加調査（個人種目　組手）'!$R19,出場資格者名簿!$D$3:$F$146,3,FALSE))","v":""}]
[null,12,"男子組手",null,null,"男子組手",{"$f":"IF(D20=\"\",\"\",VLOOKUP('③参加調査（個人種目　組手）'!F20,出場資格者名簿!$D$3:$F$146,2,FALSE))","v":""},null,{"$f":"IF($D20=\"\",\"\",VLOOKUP('③参加調査（個人種目　組手）'!$F20,出場資格者名簿!$D$3:$F$146,3,FALSE))","v":""},null,null,null,null,12,"女子組手",null,null,"女子組手",{"$f":"IF(P20=\"\",\"\",VLOOKUP('③参加調査（個人種目　組手）'!R20,出場資格者名簿!$D$3:$F$146,2,FALSE))","v":""},null,{"$f":"IF($P20=\"\",\"\",VLOOKUP('③参加調査（個人種目　組手）'!$R20,出場資格者名簿!$D$3:$F$146,3,FALSE))","v":""}]
{"$rows_left_out":49}
{"sheet":"④参加申込書（団体組手）","index":4,"n_rows":29,"n_cols":15,"rows_kept":29,"cut":false,"hidden":false,"merged":[[0,1,0,14],[1,1,1,14],[6,9,6,14],[7,2,7,3],[7,10,7,11],[6,1,6,6],[3,1,3,2],[13,2,13,3],[11,2,11,3],[11,10,11,11],[12,2,12,3],[12,10,12,11],[13,10,13,11],[10,10,10,11],[9,10,9,11],[9,2,9,3],[8,2,8,3],[8,10,8,11],[10,2,10,3]]}
[]
[null,"※熊本県少年少女大会各学年優勝者で編成する"]
[]
[null,{"$f":"'①個人種目参加調査・団体組手申込（表紙）'!J4","v":"熊本"},null,"県"]
[]
[]
[null,"男子団体組手",null,null,null,null,null,null,null,"女子団体組手"]
[null,"学年","選手氏名",null,"フリガナ","全空連会員番号","公認\n段級",null,null,null,"選手氏名",null,"フリガナ","全空連会員番号","公認\n段級"]
[null,"1年",null,null,null,null,null,null,null,"1年"]
[null,"2年",null,null,null,null,null,null,null,"2年"]
[null,"3年",null,null,null,null,null,null,null,"3年"]
[null,"4年",null,null,null,null,null,null,null,"4年"]
[null,"5年",null,null,null,null,null,null,null,"5年"]
[null,"6年",null,null,null,null,null,null,null,"6年"]
[]
[]
[]
[]
[null,null,null,null,null,null,"2段"]
[null,null,null,null,1,null,"初段"]
{"$rows_left_out":10}
{"sheet":"⑤参加申込書（団体形）","index":5,"n_rows":29,"n_cols":15,"rows_kept":29,"cut":false,"hidden":false,"merged":[[11,2,11,3],[11,10,11,11],[12,2,12,3],[12,10,12,11],[13,2,13,3],[13,10,13,11],[8,2,8,3],[8,10,8,11],[9,2,9,3],[9,10,9,11],[10,2,10,3],[10,10,10,11],[7,2,7,3],[7,10,7,11],[0,1,0,14],[1,1,1,14],[3,1,3,2],[6,1,6,6],[6,9,6,14]]}
[]
[null,"※熊本県少年少女大会優勝チーム"]
[]
[]
[]
[]
[null,"男子団体形　道場名：（宇土修武館）",null,null,null,null,null,null,null,"女子団体形　道場名：（英道館）"]
[null,"学年","選手氏名",null,"フリガナ","全空連会員番号","公認\n段級",null,null,"学年","選手氏名",null,"フリガナ","全空連会員番号","公認\n段級"]
[]
[]
[]
[]
[]
[]
[]
[]
[]
[]
[null,null,null,null,null,null,"2段"]
[null,null,null,null,1,null,"初段"]
{"$rows_left_out":10}
{"sheet":"振込み証","index":6,"n_rows":22,"n_cols":14,"rows_kept":22,"cut":false,"hidden":false,"merged":[[0,0,1,32],[14,1,14,3],[10,1,10,3],[2,4,2,7],[4,1,4,3],[5,1,5,3],[6,1,6,3],[7,1,7,3],[8,1,8,3],[3,1,3,3],[13,1,13,3],[11,1,11,3],[12,1,12,3]]}
["参加申し込み（含む　振込み証）　提出締め切り　１１月９日（’土）必着"]
[]
[]
[null,null,null,null,"参加費：円","人数：人","小計：円",null,null,null,null,null,null,"※　振込み証（道場纏めて１枚）貼付欄"]
[null,"個人形",null,null,8000]
[null,"個人組手",null,null,8000]
[null,"団体形（１チーム当り）",null,null,20000]
[null,"団体組手（１人当たり）",null,null,5000]
[null,"総計"]
[]
[null,null,null,null,"派遣費：円","人数：人","小計"]
[null,"男子",null,null,2000]
[null,"女子",null,null,2000]
[null,"パーソナルコーチ登録費",null,null,2000]
[null,"総計"]
[]
[]
[null,"道場名　　　（　　　　　　　　　　　　　　）"]
[]
[null,"道場責任者名（　　　　　　　　　　　　　　）"]
{"$rows_left_out":2}