{"text_format":"1","workbook":"xlsx","n_sheets":10,"sheets":["お願い","出場資格者名簿","①参加申込書（表紙）","②参加申込書（個人種目　形）","③参加申込書（個人種目　組手）","④参加申込書（団体種目）","⑤プログラム用男子名簿","⑥プログラム用女子名簿","⑦派遣審判員連絡先","⑧振り込み証貼付欄"],"not_rendered":{"charts":0,"images":0,"macros":1,"external_links":1,"defined_names":20,"comments":2,"pivot_tables":0},"unopened":[],"bounds":{"document_bytes":16777216,"sheet_cells":100000,"rows_first":2000,"rows_last":500,"rows_between":2000,"halvings":0,"cell_chars":16384,"cell_head_chars":4096},"cells_cut":0,"cells_raw":0,"read":"whole","date_system":"1900"}

{"sheet":"お願い","index":0,"n_rows":39,"n_cols":8,"rows_kept":39,"cut":false,"hidden":false,"merged":[[14,5,14,11],[16,5,17,11],[19,2,21,11],[3,2,3,10],[4,1,4,11],[5,2,6,10],[8,3,11,10],[24,3,24,6],[29,3,29,6],[25,3,25,6],[31,4,31,11],[23,3,23,6],[38,2,39,10],[26,3,26,6],[27,3,27,6],[28,3,28,6],[30,2,30,10],[32,4,32,10],[34,2,34,10],[36,2,37,10],[35,3,35,6]]}
[]
[]
[]
[null,null,"申込書作成のお願い"]
[]
[null,null,"参加申込書記入の前に必ず一読いただいてから記入をしていただくようお願いいたします。"]
[]
[]
[null,null,null,"㋐申込書フォーマットには様々な書式、関数、入力規則を設定しています。 各々のシートには保護をかけてありますので保護の解除、書式の変更は いかなる理由においてもしないようにお願いいたします。\n処理の効率化、時間の軽減のためご協力をお願いいたします。"]
[]
[]
[]
[null,null,null,"㋑数字の入力に関しては全て半角にてお願いいたします。"]
[null,null,null,"㋒入力は全て色つきのセルのみです。"]
[null,null,null,null,null,"左の色のセルは直接入力事項です。必要事項を入力してください。"]
{"$rows_left_out":25}
{"sheet":"出場資格者名簿","index":1,"n_rows":146,"n_cols":11,"rows_kept":146,"cut":false,"hidden":false,"merged":[]}
["【男子】"]
["種目","学年","番号",null,"名　前","県",null,"団体男子形","団体男子組手","団体女子形","団体女子組手"]
["男子形","1年",1,{"$f":"A3&B3&C3","v":"男子形1年1"},"平 咲来","福岡",null,"沖縄","福岡","長崎","福岡"]
["男子形","1年",2,{"$f":"A4&B4&C4","v":"男子形1年2"},"坂田 善","熊本",null,"福岡","長崎","沖縄","宮崎"]
["男子形","1年",3,"男子形1年3","森 皇丞","熊本",null,"佐賀","宮崎","熊本","大分"]
["男子形","1年",4,"男子形1年4","大場 善志朗","福岡",null,"熊本","鹿児島","宮崎","長崎"]
["男子形","1年",5,"男子形1年5","石原 健誠","沖縄",null,"宮崎","熊本","大分","鹿児島"]
["男子形","1年",6,"男子形1年6","西 丈汰","福岡",null,"大分","大分","鹿児島","熊本"]
["男子形","2年",1,"男子形2年1","市村　丞","福岡"]
["男子形","2年",2,"男子形2年2","森　葵志也","福岡"]
["男子形","2年",3,"男子形2年3","大城　清和","沖縄"]
["男子形","2年",4,"男子形2年4","園田　晟士","福岡"]
["男子形","2年",5,"男子形2年5","砂岡　志旺","熊本"]
["男子形","2年",6,"男子形2年6","河手　感","福岡"]
["男子形","3年",1,"男子形3年1","東條　泰介","福岡"]
{"$rows_left_out":132}
{"sheet":"①参加申込書（表紙）","index":2,"n_rows":54,"n_cols":30,"rows_kept":54,"cut":false,"hidden":false,"merged":[[51,2,51,4],[46,2,46,4],[47,2,47,4],[48,2,48,4],[49,2,49,4],[50,2,50,4],[20,2,20,12],[29,4,29,7],[0,1,0,22],[1,1,1,22],[3,9,4,13],[3,1,4,8],[3,14,4,19],[3,20,4,22],[42,20,43,21],[44,18,45,19],[7,1,7,22],[29,20,29,21],[27,19,27,21],[28,19,28,21],[29,14,29,19],[27,14,27,18],[28,14,28,18],[27,11,27,13],[28,11,28,13],[29,11,29,13],[17,2,17,12],[27,4,27,7],[28,4,28,7],[19,2,19,12],[34,5,35,7],[31,2,31,7],[34,15,35,17],[34,8,35,14],[35,2,35,4],[34,2,34,4],[42,2,42,4],[42,5,43,7],[42,8,43,14],[42,15,43,17],[43,2,43,4],[50,5,51,7],[50,8,51,14],[50,15,51,17],[46,15,47,17],[48,5,49,7],[48,8,49,14],[48,15,49,17],[46,5,47,7],[46,8,47,14],[44,2,44,4],[44,5,45,7],[44,8,45,14],[44,15,45,17],[45,2,45,4],[50,20,51,21],[33,18,33,19],[33,20,33,21],[37,18,37,19],[37,20,37,21],[34,20,35,21],[38,18,39,19],[38,20,39,21],[42,18,43,19],[34,18,35,19],[50,18,51,19],[44,20,45,21],[46,18,47,19],[46,20,47,21],[48,18,49,19],[48,20,49,21],[38,2,38,4],[39,2,39,4],[40,20,41,21],[41,2,41,4],[40,2,40,4],[40,5,41,7],[40,8,41,14],[40,15,41,17],[40,18,41,19],[38,5,39,7],[38,8,39,14],[38,15,39,17],[52,20,53,21],[53,2,53,4],[52,2,52,4],[52,5,53,7],[52,8,53,14],[52,15,53,17],[52,18,53,19]]}
[null,"令和５年度第３回全日本少年少女空手道選抜大会"]
[null,"参加申込書(表紙）"]
[]
[null,"県名",null,null,null,null,null,null,null,"熊本",null,null,null,null,"県"]
[]
[]
[null,"令和5年度第3回全日本少年少女空手道選抜大会に下記のとおり参加を申し込みます。"]
[null,"記"]
[null,"(1)申込書類①～⑦は，データファイルもメールにて送りました。"]
[null,null,"①参加申込書（表紙）　本紙",null,null,null,null,null,null,null,null,null,null,null,null,null,null,null,null,null,null,null,null,null,null,null,null,null,null,"福岡"]
[null,"　","②参加申込書（個人種目　形）",null,null,null,null,null,null,null,null,null,null,null,null,null,null,null,null,null,null,null,null,null,null,null,null,null,null,"長崎"]
[null,null,"③参加申込書（個人種目　組手）",null,null,null,null,null,null,null,null,null,null,null,null,null,null,null,null,null,null,null,null,null,null,null,null,null,null,"佐賀"]
[null,null,"④参加申込書（団体種目）",null,null,null,null,null,null,null,null,null,null,null,null,null,null,null,null,null,null,null,null,null,null,null,null,null,null,"熊本"]
[null,null,"⑤プログラム用男子名簿",null,null,null,null,null,null,null,null,null,null,null,null,null,null,null,null,null,null,null,null,null,null,null,null,null,null,"大分"]
[null,null,"⑥プログラム用女子名簿",null,null,null,null,null,null,null,null,null,null,null,null,null,null,null,null,null,null,null,null,null,null,null,null,null,null,"宮崎"]
{"$rows_left_out":40}
{"sheet":"②参加申込書（個人種目　形）","index":3,"n_rows":68,"n_cols":24,"rows_kept":68,"cut":false,"hidden":false,"merged":[[6,18,6,19],[44,1,44,11],[2,1,2,12],[3,1,3,10],[4,1,4,3],[6,6,6,7]]}
["要送信・要送付"]
[]
[null,"令和5年度第3回全日本少年少女空手道選抜大会"]
[null,"参加申込書(個人種目　形）"]
[null,"地区名",null,null,null,null,"九州","地区協議会"]
[]
[null,null,null,null,null,null,"【　男子　】",null,null,null,null,null,null,null,null,null,null,null,"【　女子　】"]
[null,null,"種目","学年","番号",null,"選手氏名","ﾌﾘｶﾅ","県名","出場意向","全空連会員番号","公認段級",null,null,"種目","学年","番号",null,"選手氏名","ﾌﾘｶﾅ","県名","出場意向","全空連会員番号","公認段級"]
[null,1,"男子形","1年",2,{"$f":"C9&D9&E9","v":"男子形1年2"},{"$f":"IF($D9=\"\",\"\",VLOOKUP('②参加申込書（個人種目　形）'!$F9,出場資格者名簿!$D$3:$F$146,2,FALSE))","v":"坂田 善"},null,{"$f":"IF($D9=\"\",\"\",VLOOKUP('②参加申込書（個人種目　形）'!$F9,出場資格者名簿!$D$3:$F$146,3,FALSE))","v":"熊本"},null,null,null,null,1,"女子形","5年",3,{"$f":"O9&P9&Q9","v":"女子形5年3"},{"$f":"IF($P9=\"\",\"\",VLOOKUP('②参加申込書（個人種目　形）'!$R9,出場資格者名簿!$D$3:$F$146,2,FALSE))","v":"荒川　叶音"},null,{"$f":"IF($P9=\"\",\"\",VLOOKUP('②参加申込書（個人種目　形）'!$R9,出場資格者名簿!$D$3:$F$146,3,FALSE))","v":"熊本"}]
[null,2,"男子形","1年",3,{"$f":"C10&D10&E10","v":"男子形1年3"},{"$f":"IF(D10=\"\",\"\",VLOOKUP('②参加申込書（個人種目　形）'!F10,出場資格者名簿!$D$3:$F$146,2,FALSE))","v":"森 皇丞"},null,{"$f":"IF($D10=\"\",\"\",VLOOKUP('②参加申込書（個人種目　形）'!$F10,出場資格者名簿!$D$3:$F$146,3,FALSE))","v":"熊本"},null,null,null,null,2,"女子形","5年",6,{"$f":"O10&P10&Q10","v":"女子形5年6"},{"$f":"IF(P10=\"\",\"\",VLOOKUP('②参加申込書（個人種目　形）'!R10,出場資格者名簿!$D$3:$F$146,2,FALSE))","v":"隈部　莉彩"},null,{"$f":"IF($P10=\"\",\"\",VLOOKUP('②参加申込書（個人種目　形）'!$R10,出場資格者名簿!$D$3:$F$146,3,FALSE))","v":"熊本"}]
[null,3,"男子形","2年",5,"男子形2年5",{"$f":"IF(D11=\"\",\"\",VLOOKUP('②参加申込書（個人種目　形）'!F11,出場資格者名簿!$D$3:$F$146,2,FALSE))","v":"砂岡　志旺"},null,{"$f":"IF($D11=\"\",\"\",VLOOKUP('②参加申込書（個人種目　形）'!$F11,出場資格者名簿!$D$3:$F$146,3,FALSE))","v":"熊本"},null,null,null,null,3,"女子形",null,null,"女子形",{"$f":"IF(P11=\"\",\"\",VLOOKUP('②参加申込書（個人種目　形）'!R11,出場資格者名簿!$D$3:$F$146,2,FALSE))","v":""},null,{"$f":"IF($P11=\"\",\"\",VLOOKUP('②参加申込書（個人種目　形）'!$R11,出場資格者名簿!$D$3:$F$146,3,FALSE))","v":""}]
[null,4,"男子形",null,null,"男子形",{"$f":"IF(D12=\"\",\"\",VLOOKUP('②参加申込書（個人種目　形）'!F12,出場資格者名簿!$D$3:$F$146,2,FALSE))","v":""},null,{"$f":"IF($D12=\"\",\"\",VLOOKUP('②参加申込書（個人種目　形）'!$F12,出場資格者名簿!$D$3:$F$146,3,FALSE))","v":""},null,null,null,null,4,"女子形",null,null,"女子形",{"$f":"IF(P12=\"\",\"\",VLOOKUP('②参加申込書（個人種目　形）'!R12,出場資格者名簿!$D$3:$F$146,2,FALSE))","v":""},null,{"$f":"IF($P12=\"\",\"\",VLOOKUP('②参加申込書（個人種目　形）'!$R12,出場資格者名簿!$D$3:$F$146,3,FALSE))","v":""}]
[null,5,"男子形",null,null,"男子形",{"$f":"IF(D13=\"\",\"\",VLOOKUP('②参加申込書（個人種目　形）'!F13,出場資格者名簿!$D$3:$F$146,2,FALSE))","v":""},null,{"$f":"IF($D13=\"\",\"\",VLOOKUP('②参加申込書（個人種目　形）'!$F13,出場資格者名簿!$D$3:$F$146,3,FALSE))","v":""},null,null,null,null,5,"女子形",null,null,"女子形",{"$f":"IF(P13=\"\",\"\",VLOOKUP('②参加申込書（個人種目　形）'!R13,出場資格者名簿!$D$3:$F$146,2,FALSE))","v":""},null,{"$f":"IF($P13=\"\",\"\",VLOOKUP('②参加申込書（個人種目　形）'!$R13,出場資格者名簿!$D$3:$F$146,3,FALSE))","v":""}]
[null,6,"男子形",null,null,"男子形",{"$f":"IF(D14=\"\",\"\",VLOOKUP('②参加申込書（個人種目　形）'!F14,出場資格者名簿!$D$3:$F$146,2,FALSE))","v":""},null,{"$f":"IF($D14=\"\",\"\",VLOOKUP('②参加申込書（個人種目　形）'!$F14,出場資格者名簿!$D$3:$F$146,3,FALSE))","v":""},null,null,null,null,6,"女子形",null,null,"女子形",{"$f":"IF(P14=\"\",\"\",VLOOKUP('②参加申込書（個人種目　形）'!R14,出場資格者名簿!$D$3:$F$146,2,FALSE))","v":""},null,{"$f":"IF($P14=\"\",\"\",VLOOKUP('②参加申込書（個人種目　形）'!$R14,出場資格者名簿!$D$3:$F$146,3,FALSE))","v":""}]
[null,7,"男子形",null,null,"男子形",{"$f":"IF(D15=\"\",\"\",VLOOKUP('②参加申込書（個人種目　形）'!F15,出場資格者名簿!$D$3:$F$146,2,FALSE))","v":""},null,{"$f":"IF($D15=\"\",\"\",VLOOKUP('②参加申込書（個人種目　形）'!$F15,出場資格者名簿!$D$3:$F$146,3,FALSE))","v":""},null,null,null,null,7,"女子形",null,null,"女子形",{"$f":"IF(P15=\"\",\"\",VLOOKUP('②参加申込書（個人種目　形）'!R15,出場資格者名簿!$D$3:$F$146,2,FALSE))","v":""},null,{"$f":"IF($P15=\"\",\"\",VLOOKUP('②参加申込書（個人種目　形）'!$R15,出場資格者名簿!$D$3:$F$146,3,FALSE))","v":""}]
{"$rows_left_out":54}
{"sheet":"③参加申込書（個人種目　組手）","index":4,"n_rows":68,"n_cols":24,"rows_kept":68,"cut":false,"hidden":false,"merged":[[6,18,6,19],[44,1,44,11],[2,1,2,12],[3,1,3,10],[4,1,4,3],[6,6,6,7]]}
["要送信・要送付"]
[]
[null,"令和5年度第3回全日本少年少女空手道選抜大会"]
[null,"参加申込書(個人種目　組手）"]
[null,"地区名",null,null,null,null,"九州","地区協議会"]
[]
[null,null,null,null,null,null,"【　男子　】",null,null,null,null,null,null,null,null,null,null,null,"【　女子　】"]
[null,null,"種目","学年","番号",null,"選手氏名","ﾌﾘｶﾅ","県名","出場意向","全空連会員番号","公認段級",null,null,"種目","学年","番号",null,"選手氏名","ﾌﾘｶﾅ","県名","出場意向","全空連会員番号","公認段級"]
[null,1,"男子組手","1年",3,{"$f":"C9&D9&E9","v":"男子組手1年3"},{"$f":"IF($D9=\"\",\"\",VLOOKUP('③参加申込書（個人種目　組手）'!$F9,出場資格者名簿!$D$3:$F$146,2,FALSE))","v":"森　皇丞"},null,{"$f":"IF($D9=\"\",\"\",VLOOKUP('③参加申込書（個人種目　組手）'!$F9,出場資格者名簿!$D$3:$F$146,3,FALSE))","v":"熊本"},null,null,null,null,1,"女子組手","1年",4,{"$f":"O9&P9&Q9","v":"女子組手1年4"},{"$f":"IF($P9=\"\",\"\",VLOOKUP('③参加申込書（個人種目　組手）'!$R9,出場資格者名簿!$D$3:$F$146,2,FALSE))","v":"上村　依緒里"},null,{"$f":"IF($P9=\"\",\"\",VLOOKUP('③参加申込書（個人種目　組手）'!$R9,出場資格者名簿!$D$3:$F$146,3,FALSE))","v":"熊本"}]
[null,2,"男子組手","2年",2,{"$f":"C10&D10&E10","v":"男子組手2年2"},{"$f":"IF(D10=\"\",\"\",VLOOKUP('③参加申込書（個人種目　組手）'!F10,出場資格者名簿!$D$3:$F$146,2,FALSE))","v":"富岡　翔空"},null,{"$f":"IF($D10=\"\",\"\",VLOOKUP('③参加申込書（個人種目　組手）'!$F10,出場資格者名簿!$D$3:$F$146,3,FALSE))","v":"熊本"},null,null,null,null,2,"女子組手","1年",5,{"$f":"O10&P10&Q10","v":"女子組手1年5"},{"$f":"IF(P10=\"\",\"\",VLOOKUP('③参加申込書（個人種目　組手）'!R10,出場資格者名簿!$D$3:$F$146,2,FALSE))","v":"藤本　志奈"},null,{"$f":"IF($P10=\"\",\"\",VLOOKUP('③参加申込書（個人種目　組手）'!$R10,出場資格者名簿!$D$3:$F$146,3,FALSE))","v":"熊本"}]
[null,3,"男子組手","2年",6,"男子組手2年6",{"$f":"IF(D11=\"\",\"\",VLOOKUP('③参加申込書（個人種目　組手）'!F11,出場資格者名簿!$D$3:$F$146,2,FALSE))","v":"濵名　晃大"},null,{"$f":"IF($D11=\"\",\"\",VLOOKUP('③参加申込書（個人種目　組手）'!$F11,出場資格者名簿!$D$3:$F$146,3,FALSE))","v":"熊本"},null,null,null,null,3,"女子組手","1年",6,"女子組手1年6",{"$f":"IF(P11=\"\",\"\",VLOOKUP('③参加申込書（個人種目　組手）'!R11,出場資格者名簿!$D$3:$F$146,2,FALSE))","v":"井芹　美柊"},null,{"$f":"IF($P11=\"\",\"\",VLOOKUP('③参加申込書（個人種目　組手）'!$R11,出場資格者名簿!$D$3:$F$146,3,FALSE))","v":"熊本"}]
[null,4,"男子組手",null,null,"男子組手",{"$f":"IF(D12=\"\",\"\",VLOOKUP('③参加申込書（個人種目　組手）'!F12,出場資格者名簿!$D$3:$F$146,2,FALSE))","v":""},null,{"$f":"IF($D12=\"\",\"\",VLOOKUP('③参加申込書（個人種目　組手）'!$F12,出場資格者名簿!$D$3:$F$146,3,FALSE))","v":""},null,null,null,null,4,"女子組手","4年",6,"女子組手4年6",{"$f":"IF(P12=\"\",\"\",VLOOKUP('③参加申込書（個人種目　組手）'!R12,出場資格者名簿!$D$3:$F$146,2,FALSE))","v":"濵名　栞希"},null,{"$f":"IF($P12=\"\",\"\",VLOOKUP('③参加申込書（個人種目　組手）'!$R12,出場資格者名簿!$D$3:$F$146,3,FALSE))","v":"熊本"}]
[null,5,"男子組手",null,null,"男子組手",{"$f":"IF(D13=\"\",\"\",VLOOKUP('③参加申込書（個人種目　組手）'!F13,出場資格者名簿!$D$3:$F$146,2,FALSE))","v":""},null,{"$f":"IF($D13=\"\",\"\",VLOOKUP('③参加申込書（個人種目　組手）'!$F13,出場資格者名簿!$D$3:$F$146,3,FALSE))","v":""},null,null,null,null,5,"女子組手","5年",3,"女子組手5年3",{"$f":"IF(P13=\"\",\"\",VLOOKUP('③参加申込書（個人種目　組手）'!R13,出場資格者名簿!$D$3:$F$146,2,FALSE))","v":"尾上　瑠希"},null,{"$f":"IF($P13=\"\",\"\",VLOOKUP('③参加申込書（個人種目　組手）'!$R13,出場資格者名簿!$D$3:$F$146,3,FALSE))","v":"熊本"}]
[null,6,"男子組手",null,null,"男子組手",{"$f":"IF(D14=\"\",\"\",VLOOKUP('③参加申込書（個人種目　組手）'!F14,出場資格者名簿!$D$3:$F$146,2,FALSE))","v":""},null,{"$f":"IF($D14=\"\",\"\",VLOOKUP('③参加申込書（個人種目　組手）'!$F14,出場資格者名簿!$D$3:$F$146,3,FALSE))","v":""},null,null,null,null,6,"女子組手",null,null,"女子組手",{"$f":"IF(P14=\"\",\"\",VLOOKUP('③参加申込書（個人種目　組手）'!R14,出場資格者名簿!$D$3:$F$146,2,FALSE))","v":""},null,{"$f":"IF($P14=\"\",\"\",VLOOKUP('③参加申込書（個人種目　組手）'!$R14,出場資格者名簿!$D$3:$F$146,3,FALSE))","v":""}]
[null,7,"男子組手",null,null,"男子組手",{"$f":"IF(D15=\"\",\"\",VLOOKUP('③参加申込書（個人種目　組手）'!F15,出場資格者名簿!$D$3:$F$146,2,FALSE))","v":""},null,{"$f":"IF($D15=\"\",\"\",VLOOKUP('③参加申込書（個人種目　組手）'!$F15,出場資格者名簿!$D$3:$F$146,3,FALSE))","v":""},null,null,null,null,7,"女子組手",null,null,"女子組手",{"$f":"IF(P15=\"\",\"\",VLOOKUP('③参加申込書（個人種目　組手）'!R15,出場資格者名簿!$D$3:$F$146,2,FALSE))","v":""},null,{"$f":"IF($P15=\"\",\"\",VLOOKUP('③参加申込書（個人種目　組手）'!$R15,出場資格者名簿!$D$3:$F$146,3,FALSE))","v":""}]
{"$rows_left_out":54}
{"sheet":"④参加申込書（団体種目）","index":5,"n_rows":69,"n_cols":32,"rows_kept":69,"cut":false,"hidden":false,"merged":[[14,2,14,3],[40,2,40,3],[40,10,40,11],[40,18,40,19],[40,26,40,27],[14,10,14,11],[14,18,14,19],[14,26,14,27],[15,2,15,3],[15,10,15,11],[15,18,15,19],[26,17,26,31],[28,2,28,3],[28,10,28,11],[28,18,28,19],[20,26,20,27],[21,2,21,3],[21,10,21,11],[21,18,21,19],[21,26,21,27],[22,26,22,27],[28,26,28,27],[39,2,39,3],[39,10,39,11],[18,2,18,3],[18,10,18,11],[18,18,18,19],[18,26,18,27],[17,2,17,3],[17,10,17,11],[17,18,17,19],[17,26,17,27],[15,26,15,27],[16,2,16,3],[16,10,16,11],[16,18,16,19],[16,26,16,27],[9,2,9,3],[9,10,9,11],[9,18,9,19],[9,26,9,27],[10,2,10,3],[10,10,10,11],[10,18,10,19],[10,26,10,27],[12,2,12,3],[12,10,12,11],[12,18,12,19],[12,26,12,27],[11,2,11,3],[11,10,11,11],[11,18,11,19],[11,26,11,27],[8,2,8,3],[8,10,8,11],[8,18,8,19],[8,26,8,27],[1,1,1,30],[2,1,2,30],[4,6,4,10],[4,11,4,15],[4,1,4,5],[6,1,6,15],[6,17,6,31],[52,1,53,15],[20,2,20,3],[20,10,20,11],[20,18,20,19],[22,2,22,3],[22,10,22,11],[22,18,22,19],[24,2,24,3],[24,10,24,11],[24,18,24,19],[29,2,29,3],[29,10,29,11],[29,18,29,19],[34,10,34,11],[34,18,34,19],[31,2,31,3],[41,2,41,3],[41,10,41,11],[41,18,41,19],[37,2,37,3],[37,10,37,11],[37,18,37,19],[38,2,38,3],[38,10,38,11],[42,2,42,3],[42,10,42,11],[42,18,42,19],[35,12,35,13],[23,2,23,3],[23,10,23,11],[23,18,23,19],[23,26,23,27],[24,26,24,27],[33,2,33,3],[33,10,33,11],[33,18,33,19],[33,26,33,27],[26,1,26,15],[31,10,31,11],[31,18,31,19],[31,26,31,27],[30,18,30,19],[30,26,30,27],[29,26,29,27],[30,2,30,3],[30,10,30,11],[36,2,36,3],[39,18,39,19],[34,2,34,3],[38,18,38,19],[38,26,38,27],[32,2,32,3],[32,10,32,11],[32,18,32,19],[32,26,32,27],[34,26,34,27],[37,26,37,27],[46,2,46,3],[47,2,47,3],[48,2,48,3],[49,2,49,3],[50,2,50,3],[44,10,44,11],[45,10,45,11],[46,10,46,11],[47,10,47,11],[48,10,48,11],[44,2,44,3],[45,2,45,3],[50,26,50,27],[49,10,49,11],[50,10,50,11],[50,18,50,19],[44,18,44,19],[45,18,45,19],[46,18,46,19],[47,18,47,19],[48,18,48,19],[49,18,49,19],[44,26,44,27],[45,26,45,27],[13,12,13,15],[13,20,13,23],[43,4,43,7],[43,28,43,31],[35,28,35,29],[46,26,46,27],[47,26,47,27],[48,26,48,27],[49,26,49,27],[42,26,42,27],[41,26,41,27],[36,10,36,11],[36,18,36,19],[36,26,36,27],[39,26,39,27]]}
[null,"要送信・要送付"]
[null,"令和５年度第３回全日本少年少女空手道選抜大会"]
[null,"参加申込書(団体種目）"]
[]
[null,"地区名",null,null,null,null,"九州",null,null,null,null,"地区協議会"]
[]
[null,"男子団体形",null,null,null,null,null,null,null,null,null,null,null,null,null,null,null,"女子団体形"]
[null,null,"A",null,null,null,null,null,null,null,"B",null,null,null,null,null,null,null,"A",null,null,null,null,null,null,null,"B"]
[null,null,"選手氏名",null,"フリガナ","全空連会員番号","学年","公認\n段級",null,null,"選手氏名",null,"フリガナ","全空連会員番号","学年","公認\n段級",null,null,"選手氏名",null,"フリガナ","全空連会員番号","学年","公認\n段級",null,null,"選手氏名",null,"フリガナ","全空連会員番号","学年","公認\n段級"]
[null,1,null,null,null,null,null,null,null,1,null,null,null,null,null,null,null,1,null,null,null,null,null,null,null,1]
[null,2,null,null,null,null,null,null,null,2,null,null,null,null,null,null,null,2,null,null,null,null,null,null,null,2]
[null,3,null,null,null,null,null,null,null,3,null,null,null,null,null,null,null,3,null,null,null,null,null,null,null,3]
[null,4,null,null,null,null,null,null,null,4,null,null,null,null,null,null,null,4,null,null,null,null,null,null,null,4]
[null,null,"C",null,null,null,null,null,null,null,"D",null,"熊本県",null,null,null,null,null,"C",null,"熊本県",null,null,null,null,null,"D"]
[null,null,"選手氏名",null,"フリガナ","全空連会員番号","学年","公認\n段級",null,null,"選手氏名",null,"フリガナ","全空連会員番号","学年","公認\n段級",null,null,"選手氏名",null,"フリガナ","全空連会員番号","学年","公認\n段級",null,null,"選手氏名",null,"フリガナ","全空連会員番号","学年","公認\n段級"]
{"$rows_left_out":55}
{"sheet":"⑤プログラム用男子名簿","index":6,"n_rows":104,"n_cols":11,"rows_kept":104,"cut":false,"hidden":false,"merged":[[0,0,0,7],[1,0,1,3],[1,4,1,8],[2,0,2,8]]}
["要送信・要送付　　出場選手名を記載し出場各種目に○印の入力をお願いします。"]
["地区名",null,null,null,"九州"]
["男子"]
["番号","県名","氏名","学年","個人組手","個人形","団体組手","団体形","引率係氏名"]
[1,{"$f":"IF(C5=\"\",\"\",'①参加申込書（表紙）'!J4:N5)","v":""}]
[2,{"$f":"IF(C6=\"\",\"\",'①参加申込書（表紙）'!J5:N6)","v":""},null,null,null,null,null,null,null,null,"北海道"]
[3,{"$f":"IF(C7=\"\",\"\",'①参加申込書（表紙）'!J6:N7)","v":""},null,null,null,null,null,null,null,null,"東北"]
[4,{"$f":"IF(C8=\"\",\"\",'①参加申込書（表紙）'!J7:N8)","v":""},null,null,null,null,null,null,null,null,"関東"]
[5,{"$f":"IF(C9=\"\",\"\",'①参加申込書（表紙）'!J8:N9)","v":""},null,null,null,null,null,null,null,null,"東海"]
[6,{"$f":"IF(C10=\"\",\"\",'①参加申込書（表紙）'!J9:N10)","v":""},null,null,null,null,null,null,null,null,"北信越"]
[7,{"$f":"IF(C11=\"\",\"\",'①参加申込書（表紙）'!J10:N11)","v":""},null,null,null,null,null,null,null,null,"近畿"]
[8,{"$f":"IF(C12=\"\",\"\",'①参加申込書（表紙）'!J11:N12)","v":""},null,null,null,null,null,null,null,null,"中国"]
[9,{"$f":"IF(C13=\"\",\"\",'①参加申込書（表紙）'!J12:N13)","v":""},null,null,null,null,null,null,null,null,"四国"]
[10,{"$f":"IF(C14=\"\",\"\",'①参加申込書（表紙）'!J13:N14)","v":""},null,null,null,null,null,null,null,null,"九州"]
[11,{"$f":"IF(C15=\"\",\"\",'①参加申込書（表紙）'!J14:N15)","v":""}]
{"$rows_left_out":90}
{"sheet":"⑥プログラム用女子名簿","index":7,"n_rows":104,"n_cols":11,"rows_kept":104,"cut":false,"hidden":false,"merged":[[0,0,0,7],[1,0,1,3],[1,4,1,8],[2,0,2,8]]}
["要送信・要送付　　出場選手名を記載し出場各種目に○印の入力をお願いします。"]
["地区名"]
["女子"]
["番号","都道府県","氏名","学年","個人組手","個人形","団体組手","団体形","引率係氏名"]
[1]
[2,null,null,null,null,null,null,null,null,null,"北海道"]
[3,null,null,null,null,null,null,null,null,null,"東北"]
[4,null,null,null,null,null,null,null,null,null,"関東"]
[5,null,null,null,null,null,null,null,null,null,"東海"]
[6,null,null,null,null,null,null,null,null,null,"北信越"]
[7,null,null,null,null,null,null,null,null,null,"近畿"]
[8,null,null,null,null,null,null,null,null,null,"中国"]
[9,null,null,null,null,null,null,null,null,null,"四国"]
[10,null,null,null,null,null,null,null,null,null,"九州"]
[11]
{"$rows_left_out":90}
{"sheet":"⑦派遣審判員連絡先","index":8,"n_rows":101,"n_cols":26,"rows_kept":101,"cut":false,"hidden":false,"merged":[[82,16,83,23],[83,1,83,3],[83,5,83,8],[83,9,83,10],[83,11,83,15],[82,1,82,3],[82,5,82,8],[82,9,82,10],[82,11,82,15],[80,16,80,23],[81,1,81,3],[81,4,81,8],[81,11,81,15],[81,16,81,23],[80,2,80,3],[80,4,80,8],[80,9,81,10],[80,11,80,15],[20,16,20,23],[21,1,21,3],[21,4,21,8],[21,11,21,15],[21,16,21,23],[17,16,18,23],[18,1,18,3],[18,9,18,10],[18,11,18,15],[18,5,18,8],[20,4,20,8],[20,9,21,10],[20,11,20,15],[17,1,17,3],[20,2,20,3],[1,1,1,22],[6,1,6,3],[6,4,6,8],[6,11,6,15],[6,16,6,23],[5,11,5,15],[5,2,5,3],[17,5,17,8],[17,9,17,10],[17,11,17,15],[15,2,15,3],[7,1,7,3],[8,1,8,3],[12,1,12,3],[13,1,13,3],[16,1,16,3],[10,2,10,3],[11,1,11,3],[3,1,3,4],[7,9,7,10],[7,11,7,15],[8,5,8,8],[11,4,11,8],[7,16,8,23],[5,16,5,23],[3,9,3,11],[5,4,5,8],[8,9,8,10],[8,11,8,15],[7,5,7,8],[3,5,3,8],[5,9,6,10],[12,5,12,8],[10,16,10,23],[13,5,13,8],[15,16,15,23],[15,9,16,10],[15,11,15,15],[16,4,16,8],[16,11,16,15],[16,16,16,23],[11,11,11,15],[11,16,11,23],[12,11,12,15],[12,16,13,23],[12,9,12,10],[13,9,13,10],[13,11,13,15],[10,9,11,10],[10,11,10,15],[15,6,15,8],[10,6,10,8],[25,4,25,8],[25,9,26,10],[25,11,25,15],[25,16,25,23],[26,1,26,3],[26,4,26,8],[26,11,26,15],[26,16,26,23],[25,2,25,3],[22,9,22,10],[22,11,22,15],[22,16,23,23],[23,1,23,3],[23,9,23,10],[23,11,23,15],[23,5,23,8],[22,1,22,3],[22,5,22,8],[27,16,28,23],[28,1,28,3],[28,9,28,10],[28,11,28,15],[28,5,28,8],[27,11,27,15],[27,1,27,3],[27,5,27,8],[27,9,27,10],[31,1,31,3],[31,4,31,8],[31,11,31,15],[31,16,31,23],[30,9,31,10],[30,11,30,15],[30,16,30,23],[30,2,30,3],[30,4,30,8],[36,16,36,23],[35,2,35,3],[35,4,35,8],[35,9,36,10],[35,11,35,15],[35,16,35,23],[37,16,38,23],[32,16,33,23],[38,5,38,8],[33,1,33,3],[33,9,33,10],[33,11,33,15],[33,5,33,8],[32,1,32,3],[32,5,32,8],[32,9,32,10],[32,11,32,15],[36,1,36,3],[36,4,36,8],[36,11,36,15],[38,1,38,3],[38,9,38,10],[38,11,38,15],[37,1,37,3],[37,5,37,8],[37,9,37,10],[37,11,37,15],[40,16,40,23],[41,1,41,3],[41,4,41,8],[41,11,41,15],[41,16,41,23],[40,2,40,3],[40,4,40,8],[40,9,41,10],[40,11,40,15],[42,16,43,23],[43,1,43,3],[43,9,43,10],[43,11,43,15],[43,5,43,8],[42,1,42,3],[42,5,42,8],[42,9,42,10],[42,11,42,15],[47,11,47,15],[47,16,48,23],[48,1,48,3],[48,5,48,8],[48,9,48,10],[48,11,48,15],[45,2,45,3],[47,1,47,3],[47,5,47,8],[47,9,47,10],[46,1,46,3],[46,4,46,8],[46,11,46,15],[46,16,46,23],[45,4,45,8],[45,9,46,10],[45,11,45,15],[45,16,45,23],[52,11,52,15],[52,16,53,23],[53,1,53,3],[53,5,53,8],[53,9,53,10],[53,11,53,15],[50,2,50,3],[52,1,52,3],[52,5,52,8],[52,9,52,10],[51,1,51,3],[51,4,51,8],[51,11,51,15],[51,16,51,23],[50,4,50,8],[50,9,51,10],[50,11,50,15],[50,16,50,23],[57,11,57,15],[57,16,58,23],[58,1,58,3],[58,5,58,8],[58,9,58,10],[58,11,58,15],[55,2,55,3],[57,1,57,3],[57,5,57,8],[57,9,57,10],[56,1,56,3],[56,4,56,8],[56,11,56,15],[56,16,56,23],[55,4,55,8],[55,9,56,10],[55,11,55,15],[55,16,55,23],[62,11,62,15],[62,16,63,23],[63,1,63,3],[63,5,63,8],[63,9,63,10],[63,11,63,15],[60,2,60,3],[62,1,62,3],[62,5,62,8],[62,9,62,10],[61,1,61,3],[61,4,61,8],[61,11,61,15],[61,16,61,23],[60,4,60,8],[60,9,61,10],[60,11,60,15],[60,16,60,23],[67,11,67,15],[67,16,68,23],[68,1,68,3],[68,5,68,8],[68,9,68,10],[68,11,68,15],[65,2,65,3],[67,1,67,3],[67,5,67,8],[67,9,67,10],[66,1,66,3],[66,4,66,8],[66,11,66,15],[66,16,66,23],[65,4,65,8],[65,9,66,10],[65,11,65,15],[65,16,65,23],[73,11,73,15],[70,2,70,3],[72,1,72,3],[72,5,72,8],[72,9,72,10],[71,1,71,3],[71,4,71,8],[71,11,71,15],[71,16,71,23],[70,4,70,8],[70,9,71,10],[70,11,70,15],[70,16,70,23],[72,11,72,15],[72,16,73,23],[73,1,73,3],[73,5,73,8],[73,9,73,10],[77,11,77,15],[77,16,78,23],[78,1,78,3],[78,5,78,8],[78,9,78,10],[78,11,78,15],[75,2,75,3],[77,1,77,3],[77,5,77,8],[77,9,77,10],[76,1,76,3],[76,4,76,8],[76,11,76,15],[76,16,76,23],[75,4,75,8],[75,9,76,10],[75,11,75,15],[75,16,75,23]]}
[]
[null,"令和５年度第３回全日本少年少女空手道選抜大会　派遣審判員連絡先"]
[]
[null,"地区名",null,null,null,"九州",null,null,null,"地区協議会"]
[]
[null,"都道府県",null,null,"（フリガナ）　",null,null,null,null,"種別",null,"審　　判　　資　　格",null,null,null,null,"流　　　派",null,null,null,null,null,null,null,null,1]
[null,"氏　　名",null,null,null,null,null,null,null,null,null,"(形は該当するものを選択)",null,null,null,null,"(該当するものを選択)"]
[null,"会員番号",null,null,"№",null,null,null,null,"組手"]
[null,"有効期限",null,null,"西暦",null,null,null,null,"形"]
[]
[null,"都道府県",null,null,"（フリガナ）　",null,null,null,null,"種別",null,"審　　判　　資　　格",null,null,null,null,"流　　　派",null,null,null,null,null,null,null,null,2]
[null,"氏　　名",null,null,null,null,null,null,null,null,null,"(形は該当するものを選択)",null,null,null,null,"(該当するものを選択)"]
[null,"会員番号",null,null,"№",null,null,null,null,"組手"]
[null,"有効期限",null,null,"西暦",null,null,null,null,"形"]
[]
{"$rows_left_out":87}
{"sheet":"⑧振り込み証貼付欄","index":9,"n_rows":8,"n_cols":1,"rows_kept":8,"cut":false,"hidden":false,"merged":[[0,0,6,24],[7,0,39,24]]}
["振り込み証　締め切り　１１月１２日（日）　　　　　参加費・派遣費の金額は事務連絡に明記"]
[]
[]
[]
[]
[]
[]
["振り込み証貼付欄"]